Target
Hexokinase-4
Ligand
BDBM50533462
Substrate
Meas. Tech.
ChEMBL_1925588 (CHEMBL4428660)
Kd
720±n/a nM
Citation
 Mollica, LTheret, IAntoine, MPerron-Sierra, FCharton, YFourquez, JMWierzbicki, MBoutin, JAFerry, GDecherchi, SBottegoni, GDucrot, PCavalli, A Molecular Dynamics Simulations and Kinetic Measurements to Estimate and Predict Protein-Ligand Residence Times. J Med Chem 59:7167-76 (2016)  
Target
Name:
Hexokinase-4
Synonyms:
GCK Glucokinase (GK) HK IV HXK4_HUMAN Hexokinase-D
Type:
Enzyme
Mol. Mass.:
52175.81
Organism:
Homo sapiens (Human)
Description:
P35557
Residue:
465
  
Inhibitor
Name:
BDBM50533462
Synonyms:
CHEMBL4534484
Type:
Small organic molecule
Emp. Form.:
C21H24N2O5
Mol. Mass.:
384.4257
SMILES:
CC(C)Oc1cc(OC(C)C)cc(c1)C(=O)Nc1ccc(\C=C\C(O)=O)cn1
: