Target
Sodium- and chloride-dependent glycine transporter 1
Ligand
BDBM50533742
Substrate
Meas. Tech.
ChEMBL_1926804 (CHEMBL4429876)
IC50
0.671000±n/a nM
Citation
 Cioffi, CLLiu, SWolf, MAGuzzo, PRSadalapure, KParthasarathy, VLoong, DTMaeng, JHCarulli, EFang, XKarunakaran, KMatta, LChoo, SHPanduga, SBuckle, RNDavis, RNSakwa, SAGupta, PSargent, BJMoore, NALuche, MMCarr, GJKhmelnitsky, YLIsmail, JChung, MBai, MLeong, WYSachdev, NSwaminathan, SMhyre, AJ Synthesis and Biological Evaluation of N-((1-(4-(Sulfonyl)piperazin-1-yl)cycloalkyl)methyl)benzamide Inhibitors of Glycine Transporter-1. J Med Chem 59:8473-94 (2016)  
Target
Name:
Sodium- and chloride-dependent glycine transporter 1
Synonyms:
GlyT-1 Glycine Transporters (GlyT1c) SC6A9_HUMAN Sodium- and chloride-dependent glycine transporter 1 Sodium- and chloride-dependent glycine transporter 1 (GlyT1c) Solute carrier family 6 member 9
Type:
Enzyme
Mol. Mass.:
78270.54
Organism:
Homo sapiens (Human)
Description:
P48067
Residue:
706
  
Inhibitor
Name:
BDBM50533742
Synonyms:
CHEMBL4593786
Type:
Small organic molecule
Emp. Form.:
C22H27Cl2F5N6O3S
Mol. Mass.:
621.451
SMILES:
Cl.Cn1cc(nn1)S(=O)(=O)N1CCN(CC1)C1(CNC(=O)c2ccc(cc2Cl)C(F)(F)F)CCC(F)(F)CC1
: