Target
Beta-1 adrenergic receptor
Ligand
BDBM50089495
Substrate
Meas. Tech.
ChEBML_37266
IC50
2000±n/a nM
Citation
 Biftu, TFeng, DDLiang, GBKuo, HQian, XNaylor, EMColandrea, VJCandelore, MRCascieri, MAColwell, LFForrest, MJHom, GJMacIntyre, DEStearns, RAStrader, CDWyvratt, MJFisher, MHWeber, AE Synthesis and SAR of benzyl and phenoxymethylene oxadiazole benzenesulfonamides as selective beta3 adrenergic receptor agonist antiobesity agents. Bioorg Med Chem Lett 10:1431-4 (2000)  
Target
Name:
Beta-1 adrenergic receptor
Synonyms:
ADRB1 ADRB1_HUMAN Beta-1 adrenoceptor | adrenergic Beta1
Type:
G Protein-Coupled Receptor (GPCR)
Mol. Mass.:
51338.40
Organism:
Homo sapiens (Human)
Description:
P08588
Residue:
477
  
Inhibitor
Name:
BDBM50089495
Synonyms:
CHEMBL34406 | N-{4-[2-((R)-2-Hydroxy-2-pyridin-3-yl-ethylamino)-ethyl]-phenyl}-4-[5-(4-methoxy-phenoxymethyl)-[1,2,4]oxadiazol-3-yl]-benzenesulfonamide
Type:
Small organic molecule
Emp. Form.:
C31H31N5O6S
Mol. Mass.:
601.673
SMILES:
COc1ccc(OCc2nc(no2)-c2ccc(cc2)S(=O)(=O)Nc2ccc(CCNC[C@H](O)c3cccnc3)cc2)cc1
: