Target
Substance-K receptor
Ligand
BDBM50089567
Substrate
Meas. Tech.
ChEBML_209022
IC50
55±n/a nM
Citation
 Gerspacher, Mvon Sprecher, AMah, RAnderson, GPBertrand, CSubramanian, NHauser, KBall, HA N-[(R,R)-(E)-1-(4-chloro-benzyl)-3-(2-oxo-azepan-3-ylcarbamoyl)-allyl]-N-methyl-3,5-bis-trifluoromethyl-benzamide: an orally active neurokinin NK1/NK2 antagonist. Bioorg Med Chem Lett 10:1467-70 (2000)  
Target
Name:
Substance-K receptor
Synonyms:
NK-2 receptor NK2R NKNAR Neurokinin A receptor Neurokinin-2 (NK-2) SKR TACR2 Tachykinin receptor 2 (NK2) | hnk-3
Type:
Protein
Mol. Mass.:
44455.78
Organism:
Homo sapiens (Human)
Description:
P21452
Residue:
398
  
Inhibitor
Name:
BDBM50089567
Synonyms:
CHEMBL35857 | N-[(E)-1-(4-Chloro-benzyl)-3-(2-oxo-azepan-3-ylcarbamoyl)-allyl]-N-methyl-3,5-bis-trifluoromethyl-benzamide
Type:
Small organic molecule
Emp. Form.:
C27H26ClF6N3O3
Mol. Mass.:
589.957
SMILES:
CN(C(Cc1ccc(Cl)cc1)\C=C\C(=O)NC1CCCCNC1=O)C(=O)c1cc(cc(c1)C(F)(F)F)C(F)(F)F
: