Target
Polyphenol oxidase 2
Ligand
BDBM50041234
Substrate
Meas. Tech.
ChEMBL_1927666 (CHEMBL4430738)
EC50
14800±n/a nM
Citation
 Niu, CYin, LNie, LFDou, JZhao, JYLi, GAisa, HA Synthesis and bioactivity of novel isoxazole chalcone derivatives on tyrosinase and melanin synthesis in murine B16 cells for the treatment of vitiligo. Bioorg Med Chem 24:5440-5448 (2016)  
Target
Name:
Polyphenol oxidase 2
Synonyms:
Monophenol monooxygenase PPO2 Tyrosinase
Type:
Protein
Mol. Mass.:
63923.66
Organism:
Agaricus bisporus (Common mushroom)
Description:
O42713
Residue:
556
  
Inhibitor
Name:
BDBM50041234
Synonyms:
6-hydroxy-7-methoxy-5-benzofuranacrylic acid delta-lactone 8-methoxy-2',3',6,7-furocoumarin 8-methoxy-[furano-3'.2':6.7-coumarin] 9-methoxy-7H-furo[3,2-g][1]benzopyran-7-one CHEMBL416 xanthotoxin
Type:
Small organic molecule
Emp. Form.:
C12H8O4
Mol. Mass.:
216.1895
SMILES:
COc1c2occc2cc2ccc(=O)oc12
: