Target
Endothelin-1 receptor
Ligand
BDBM50051007
Substrate
Meas. Tech.
ChEMBL_1928599 (CHEMBL4431775)
Ki
0.034000±n/a nM
Citation
 Aubert, JDJuillerat-Jeanneret, L Endothelin-Receptor Antagonists beyond Pulmonary Arterial Hypertension: Cancer and Fibrosis. J Med Chem 59:8168-88 (2016)  
Target
Name:
Endothelin-1 receptor
Synonyms:
EDNRA ET-A ETA-R Endothelin receptor type A hET-AR
Type:
Enzyme Catalytic Domain
Mol. Mass.:
48736.88
Organism:
Homo sapiens (Human)
Description:
P25101
Residue:
427
  
Inhibitor
Name:
BDBM50051007
Synonyms:
(2R,3R,4S)-4-Benzo[1,3]dioxol-5-yl-1-dibutylcarbamoylmethyl-2-(4-methoxy-phenyl)-pyrrolidine-3-carboxylic acid A-127722 | CHEMBL9194
Type:
Small organic molecule
Emp. Form.:
C29H38N2O6
Mol. Mass.:
510.6218
SMILES:
CCCCN(CCCC)C(=O)CN1C[C@@H]([C@H]([C@@H]1c1ccc(OC)cc1)C(O)=O)c1ccc2OCOc2c1
: