Target
Calmodulin-domain protein kinase 1
Ligand
BDBM50534383
Substrate
Meas. Tech.
ChEMBL_1928610 (CHEMBL4431786)
IC50
1.6±n/a nM
Citation
 Vidadala, RSRivas, KLOjo, KKHulverson, MAZambriski, JABruzual, ISchultz, TLHuang, WZhang, ZScheele, SDeRocher, AEChoi, RBarrett, LKSiddaramaiah, LKHol, WGFan, EMerritt, EAParsons, MFreiberg, GMarsh, KKempf, DJCarruthers, VBIsoherranen, NDoggett, JSVan Voorhis, WCMaly, DJ Development of an Orally Available and Central Nervous System (CNS) Penetrant Toxoplasma gondii Calcium-Dependent Protein Kinase 1 (TgCDPK1) Inhibitor with Minimal Human Ether-a-go-go-Related Gene (hERG) Activity for the Treatment of Toxoplasmosis. J Med Chem 59:6531-46 (2016)  
Target
Name:
Calmodulin-domain protein kinase 1
Synonyms:
Calmodulin-domain protein kinase 1 Calmodulin-domain protein kinase, putative
Type:
Enzyme Catalytic Domain
Mol. Mass.:
57248.42
Organism:
Toxoplasma gondii
Description:
Residue:
507
  
Inhibitor
Name:
BDBM50534383
Synonyms:
CHEMBL4517731
Type:
Small organic molecule
Emp. Form.:
C24H27N7O
Mol. Mass.:
429.5175
SMILES:
CN1CCC(Cn2nc(-c3ccc4nc(OC5CC5)ccc4c3)c3c(N)ncnc23)CC1
: