Target
Calmodulin-domain protein kinase 1
Ligand
BDBM50534387
Substrate
Meas. Tech.
ChEMBL_1928610 (CHEMBL4431786)
IC50
4.0±n/a nM
Citation
 Vidadala, RSRivas, KLOjo, KKHulverson, MAZambriski, JABruzual, ISchultz, TLHuang, WZhang, ZScheele, SDeRocher, AEChoi, RBarrett, LKSiddaramaiah, LKHol, WGFan, EMerritt, EAParsons, MFreiberg, GMarsh, KKempf, DJCarruthers, VBIsoherranen, NDoggett, JSVan Voorhis, WCMaly, DJ Development of an Orally Available and Central Nervous System (CNS) Penetrant Toxoplasma gondii Calcium-Dependent Protein Kinase 1 (TgCDPK1) Inhibitor with Minimal Human Ether-a-go-go-Related Gene (hERG) Activity for the Treatment of Toxoplasmosis. J Med Chem 59:6531-46 (2016)  
Target
Name:
Calmodulin-domain protein kinase 1
Synonyms:
Calmodulin-domain protein kinase 1 Calmodulin-domain protein kinase, putative
Type:
Enzyme Catalytic Domain
Mol. Mass.:
57248.42
Organism:
Toxoplasma gondii
Description:
Residue:
507
  
Inhibitor
Name:
BDBM50534387
Synonyms:
CHEMBL4582694
Type:
Small organic molecule
Emp. Form.:
C23H24N6O2
Mol. Mass.:
416.4757
SMILES:
CCOc1ccc2cc(ccc2c1)-c1nn(CC2CN(C2)C(C)=O)c2ncnc(N)c12
: