Target
Calmodulin-domain protein kinase 1
Ligand
BDBM416542
Substrate
Meas. Tech.
ChEMBL_1928610 (CHEMBL4431786)
IC50
94±n/a nM
Citation
 Vidadala, RSRivas, KLOjo, KKHulverson, MAZambriski, JABruzual, ISchultz, TLHuang, WZhang, ZScheele, SDeRocher, AEChoi, RBarrett, LKSiddaramaiah, LKHol, WGFan, EMerritt, EAParsons, MFreiberg, GMarsh, KKempf, DJCarruthers, VBIsoherranen, NDoggett, JSVan Voorhis, WCMaly, DJ Development of an Orally Available and Central Nervous System (CNS) Penetrant Toxoplasma gondii Calcium-Dependent Protein Kinase 1 (TgCDPK1) Inhibitor with Minimal Human Ether-a-go-go-Related Gene (hERG) Activity for the Treatment of Toxoplasmosis. J Med Chem 59:6531-46 (2016)  
Target
Name:
Calmodulin-domain protein kinase 1
Synonyms:
Calmodulin-domain protein kinase 1 Calmodulin-domain protein kinase, putative
Type:
Enzyme Catalytic Domain
Mol. Mass.:
57248.42
Organism:
Toxoplasma gondii
Description:
Residue:
507
  
Inhibitor
Name:
BDBM416542
Synonyms:
US10307425, Example 8 | US10632122, Example 8
Type:
Small organic molecule
Emp. Form.:
C22H17F6N5O2
Mol. Mass.:
497.3931
SMILES:
Nc1ncnc2n(CC(O)(C(F)(F)F)C(F)(F)F)nc(-c3ccc4cc(OC5CC5)ccc4c3)c12
: