Target
Potassium voltage-gated channel subfamily H member 2
Ligand
BDBM416544
Substrate
Meas. Tech.
ChEMBL_1928615 (CHEMBL4431791)
IC50
900±n/a nM
Citation
 Vidadala, RSRivas, KLOjo, KKHulverson, MAZambriski, JABruzual, ISchultz, TLHuang, WZhang, ZScheele, SDeRocher, AEChoi, RBarrett, LKSiddaramaiah, LKHol, WGFan, EMerritt, EAParsons, MFreiberg, GMarsh, KKempf, DJCarruthers, VBIsoherranen, NDoggett, JSVan Voorhis, WCMaly, DJ Development of an Orally Available and Central Nervous System (CNS) Penetrant Toxoplasma gondii Calcium-Dependent Protein Kinase 1 (TgCDPK1) Inhibitor with Minimal Human Ether-a-go-go-Related Gene (hERG) Activity for the Treatment of Toxoplasmosis. J Med Chem 59:6531-46 (2016)  
Target
Name:
Potassium voltage-gated channel subfamily H member 2
Synonyms:
1,3-beta-glucan synthase component GLS2 ERG Eag-related protein 1 Ether-a-go-go-related gene (HERG) Ether-a-go-go-related gene potassium channel 1 Ether-a-go-go-related gene potassium channel 1 (hERG1) Ether-a-go-go-related protein 1 H-ERG KCNH2 Potassium voltage-gated channel subfamily H member 2 (hERG) Voltage-gated potassium channel subunit Kv11.1 hERG Potassium Channel 1 | putative potassium channel subunit
Type:
Multi-pass membrane protein
Mol. Mass.:
126672.65
Organism:
Homo sapiens (Human)
Description:
Q12809
Residue:
1159
  
Inhibitor
Name:
BDBM416544
Synonyms:
US10307425, Example 10 | US10632122, Example 10
Type:
Small organic molecule
Emp. Form.:
C26H30N6O
Mol. Mass.:
442.556
SMILES:
CN1CCC(Cn2nc(-c3ccc4cc(OCC5CC5)ccc4c3)c3c(N)ncnc23)CC1
: