Target
Calmodulin-domain protein kinase 1
Ligand
BDBM416552
Substrate
Meas. Tech.
ChEMBL_1928610 (CHEMBL4431786)
IC50
1.2±n/a nM
Citation
 Vidadala, RSRivas, KLOjo, KKHulverson, MAZambriski, JABruzual, ISchultz, TLHuang, WZhang, ZScheele, SDeRocher, AEChoi, RBarrett, LKSiddaramaiah, LKHol, WGFan, EMerritt, EAParsons, MFreiberg, GMarsh, KKempf, DJCarruthers, VBIsoherranen, NDoggett, JSVan Voorhis, WCMaly, DJ Development of an Orally Available and Central Nervous System (CNS) Penetrant Toxoplasma gondii Calcium-Dependent Protein Kinase 1 (TgCDPK1) Inhibitor with Minimal Human Ether-a-go-go-Related Gene (hERG) Activity for the Treatment of Toxoplasmosis. J Med Chem 59:6531-46 (2016)  
Target
Name:
Calmodulin-domain protein kinase 1
Synonyms:
Calmodulin-domain protein kinase 1 Calmodulin-domain protein kinase, putative
Type:
Enzyme Catalytic Domain
Mol. Mass.:
57248.42
Organism:
Toxoplasma gondii
Description:
Residue:
507
  
Inhibitor
Name:
BDBM416552
Synonyms:
US10307425, Example 18 | US10632122, Example 18
Type:
Small organic molecule
Emp. Form.:
C21H22N6O
Mol. Mass.:
374.439
SMILES:
CC(C)Cn1nc(-c2ccc3nc(OC4CC4)ccc3c2)c2c(N)ncnc12
: