Target
Delta-type opioid receptor
Ligand
BDBM50090100
Substrate
Meas. Tech.
ChEMBL_146922 (CHEMBL757314)
Ki
41.5±n/a nM
Citation
 Stevens, WCJones, RMSubramanian, GMetzger, TGFerguson, DMPortoghese, PS Potent and selective indolomorphinan antagonists of the kappa-opioid receptor. J Med Chem 43:2759-69 (2000)  
Target
Name:
Delta-type opioid receptor
Synonyms:
Cytochrome P450 3A4 Delta opioid receptor Delta-type opioid receptor (DOR) OPRD_RAT Opioid receptor Opioid receptors; mu & delta Ror-a | Voltage-gated potassium channel
Type:
G Protein-Coupled Receptor (GPCR)
Mol. Mass.:
40465.04
Organism:
Rattus norvegicus (rat)
Description:
Competition binding assays were using CHO-K1 cell membranes expressing the opioid receptor.
Residue:
372
  
Inhibitor
Name:
BDBM50090100
Synonyms:
CHEMBL319202 | Norbinaltorphimine (norBNI)
Type:
Small organic molecule
Emp. Form.:
C40H43N3O6
Mol. Mass.:
661.7859
SMILES:
Oc1ccc2CC3N(CC4CC4)CC[C@@]45C(Oc1c24)c1[nH]c2CC4(O)[C@H]6Cc7ccc(O)c8OC(c2c1CC35O)C4(CCN6CC1CC1)c78
: