Target
E3 ubiquitin-protein ligase XIAP
Ligand
BDBM50240586
Substrate
Meas. Tech.
ChEMBL_1929902 (CHEMBL4433078)
IC50
91±n/a nM
Citation
 Manzoni, LGornati, DManzotti, MCairati, SBossi, AArosio, DLecis, DSeneci, P Dual action Smac mimetics-zinc chelators as pro-apoptotic antitumoral agents. Bioorg Med Chem Lett 26:4613-4619 (2016)  
Target
Name:
E3 ubiquitin-protein ligase XIAP
Synonyms:
API3 E3 ubiquitin-protein ligase XIAP Inhibitor of apoptosis protein 3 X-linked inhibitor of apoptosis XIAP | XIAP_HUMAN
Type:
Protein
Mol. Mass.:
56685.27
Organism:
Homo sapiens (Human)
Description:
P98170
Residue:
497
  
Inhibitor
Name:
BDBM50240586
Synonyms:
CHEMBL4098982
Type:
Small organic molecule
Emp. Form.:
C45H55N9O5
Mol. Mass.:
801.9755
SMILES:
[H][C@]12CC[C@H](N1C(=O)[C@@H](NC(=O)[C@H](CC)NC)[C@@H](CNC(=O)c1ccccc1)CC2)C(=O)N[C@H](C(=O)NCCN(Cc1ccccn1)Cc1ccccn1)c1ccccc1
: