Target
Ephrin type-A receptor 4
Ligand
BDBM50535195
Substrate
Meas. Tech.
ChEMBL_1929961 (CHEMBL4433137)
Kd
19±n/a nM
Citation
 Olson, EJLechtenberg, BCZhao, CRubio de la Torre, ELamberto, IRiedl, SJDawson, PEPasquale, EB Modifications of a Nanomolar Cyclic Peptide Antagonist for the EphA4 Receptor To Achieve High Plasma Stability. ACS Med Chem Lett 7:841-6 (2016)  
Target
Name:
Ephrin type-A receptor 4
Synonyms:
EPHA4 Ephrin receptor HEK8 TYRO1
Type:
PROTEIN
Mol. Mass.:
109859.29
Organism:
Homo sapiens (Human)
Description:
ChEMBL_586961
Residue:
986
  
Inhibitor
Name:
BDBM50535195
Synonyms:
CHEMBL4530593
Type:
Small organic molecule
Emp. Form.:
C67H91N17O18S2
Mol. Mass.:
1486.673
SMILES:
CC(C)[C@@H]1NC(=O)[C@H](CSSC[C@H](NC(=O)[C@H](CCC(O)=O)NC(=O)[C@H](Cc2c[nH]c3ccccc23)NC(=O)[C@H](CCC(O)=O)NC(=O)CCNC(=O)[C@H](CCCNC(N)=N)NC(=O)[C@H](Cc2ccc(O)cc2)NC1=O)C(N)=O)NC(=O)[C@H](Cc1ccc(O)cc1)NC(=O)[C@@H]1CCCN1C(=O)CCN
: