Target
Caspase-1
Ligand
BDBM50091562
Substrate
Meas. Tech.
ChEMBL_46497 (CHEMBL659500)
IC50
200000±n/a nM
Citation
 Talanian, RVBrady, KDCryns, VL Caspases as targets for anti-inflammatory and anti-apoptotic drug discovery. J Med Chem 43:3351-71 (2000)  
Target
Name:
Caspase-1
Synonyms:
CASP1 Caspase ICE IL1BCE Interleukin-1 beta-converting enzyme
Type:
Enzyme
Mol. Mass.:
45154.13
Organism:
Homo sapiens (Human)
Description:
P29466
Residue:
404
  
Inhibitor
Name:
BDBM50091562
Synonyms:
3-((S)-2-{(S)-2-[(S)-2-Acetylamino-3-(4-hydroxy-phenyl)-propionylamino]-3-methyl-butyrylamino}-propionylamino)-propionic acid CHEMBL308500
Type:
Small organic molecule
Emp. Form.:
C22H32N4O7
Mol. Mass.:
464.5121
SMILES:
CC(C)[C@H](NC(=O)[C@H](Cc1ccc(O)cc1)NC(C)=O)C(=O)N[C@@H](C)C(=O)NCCC(O)=O
: