Target
Caspase-1
Ligand
BDBM50091589
Substrate
Meas. Tech.
ChEMBL_46497 (CHEMBL659500)
IC50
10±n/a nM
Citation
 Talanian, RVBrady, KDCryns, VL Caspases as targets for anti-inflammatory and anti-apoptotic drug discovery. J Med Chem 43:3351-71 (2000)  
Target
Name:
Caspase-1
Synonyms:
CASP1 Caspase ICE IL1BCE Interleukin-1 beta-converting enzyme
Type:
Enzyme
Mol. Mass.:
45154.13
Organism:
Homo sapiens (Human)
Description:
P29466
Residue:
404
  
Inhibitor
Name:
BDBM50091589
Synonyms:
3-({5-[(Naphthalene-1-carbonyl)-amino]-4-oxo-1,2,4,5,6,7-hexahydro-azepino[3,2,1-hi]indole-2-carbonyl}-amino)-4-oxo-butyric acid | CHEMBL114791
Type:
Small organic molecule
Emp. Form.:
C28H25N3O6
Mol. Mass.:
499.5146
SMILES:
OC(=O)C[C@H](NC(=O)[C@@H]1Cc2cccc3CC[C@H](NC(=O)c4cccc5ccccc45)C(=O)N1c23)C=O
: