Target
Gastrin/cholecystokinin type B receptor
Ligand
BDBM50092405
Substrate
Meas. Tech.
ChEMBL_48099 (CHEMBL663086)
Ki
0.28±n/a nM
Citation
 Bellier, BMillion, MEDaNascimento, SMeudal, HKellou, SMaigret, BGarbay, C Replacement of glycine with dicarbonyl and related moieties in analogues of the C-terminal pentapeptide of cholecystokinin: CCK(2) agonists displaying a novel binding mode. J Med Chem 43:3614-23 (2000)  
Target
Name:
Gastrin/cholecystokinin type B receptor
Synonyms:
CCK-2 receptor CCK-BR CCKRB Cholecystokinin receptor GASR_HUMAN | Gastrin/cholecystokinin type B receptor
Type:
G Protein-Coupled Receptor (GPCR)
Mol. Mass.:
48445.79
Organism:
Homo sapiens (Human)
Description:
Stable expression of human CCK-2 receptors in HEK 293 cells.
Residue:
447
  
Inhibitor
Name:
BDBM50092405
Synonyms:
(S)-N-((S)-1-Carbamoyl-2-phenyl-ethyl)-3-((S)-2-{[(S)-2-(2-carboxy-acetylamino)-3-(1H-indol-3-yl)-propionyl]-methyl-amino}-hexanoylamino)-succinamic acid N-(1-Carbamoyl-2-phenyl-ethyl)-3-(2-{[2-(2-carboxy-acetylamino)-3-(1H-indol-3-yl)-propionyl]-methyl-amino}-hexanoylamino)-succinamic acid
Type:
Small organic molecule
Emp. Form.:
C34H42N6O9
Mol. Mass.:
678.7321
SMILES:
CCCC[C@H](N(C)C(=O)[C@H](Cc1c[nH]c2ccccc12)NC(=O)CC(O)=O)C(=O)N[C@@H](CC(O)=O)C(=O)N[C@@H](Cc1ccccc1)C(N)=O
: