Target
Cholecystokinin receptor type A
Ligand
BDBM50092405
Substrate
Meas. Tech.
ChEMBL_49727 (CHEMBL661969)
Ki
>0.7±n/a nM
Citation
 Bellier, BMillion, MEDaNascimento, SMeudal, HKellou, SMaigret, BGarbay, C Replacement of glycine with dicarbonyl and related moieties in analogues of the C-terminal pentapeptide of cholecystokinin: CCK(2) agonists displaying a novel binding mode. J Med Chem 43:3614-23 (2000)  
Target
Name:
Cholecystokinin receptor type A
Synonyms:
CCK-A receptor CCK1-R CCKAR_CAVPO Cholecystokinin receptor type A | Cholecystokinin-1 receptor
Type:
Mol. Mass.:
48229.77
Organism:
Cavia porcellus
Description:
Residue:
430
  
Inhibitor
Name:
BDBM50092405
Synonyms:
(S)-N-((S)-1-Carbamoyl-2-phenyl-ethyl)-3-((S)-2-{[(S)-2-(2-carboxy-acetylamino)-3-(1H-indol-3-yl)-propionyl]-methyl-amino}-hexanoylamino)-succinamic acid N-(1-Carbamoyl-2-phenyl-ethyl)-3-(2-{[2-(2-carboxy-acetylamino)-3-(1H-indol-3-yl)-propionyl]-methyl-amino}-hexanoylamino)-succinamic acid
Type:
Small organic molecule
Emp. Form.:
C34H42N6O9
Mol. Mass.:
678.7321
SMILES:
CCCC[C@H](N(C)C(=O)[C@H](Cc1c[nH]c2ccccc12)NC(=O)CC(O)=O)C(=O)N[C@@H](CC(O)=O)C(=O)N[C@@H](Cc1ccccc1)C(N)=O
: