Target
Nuclear receptor ROR-gamma
Ligand
BDBM50536791
Substrate
Meas. Tech.
ChEMBL_1934543 (CHEMBL4480195)
EC50
47±n/a nM
Citation
 René, OFauber, BPBarnard, AChapman, KDeng, YEidenschenk, CEverett, CGobbi, AJohnson, ARLa, HNorman, MSalmon, GSummerhill, SWong, H Discovery of oxa-sultams as RORc inverse agonists showing reduced lipophilicity, improved selectivity and favorable ADME properties. Bioorg Med Chem Lett 26:4455-4461 (2016)  
Target
Name:
Nuclear receptor ROR-gamma
Synonyms:
NR1F3 Nuclear receptor ROR-gamma (RORC) RAR-related orphan receptor C (RORc) RORG RZRG Retinoid-related orphan receptor-gamma (RORc)
Type:
Enzyme Catalytic Domain
Mol. Mass.:
58218.40
Organism:
Homo sapiens (Human)
Description:
P51449
Residue:
518
  
Inhibitor
Name:
BDBM50536791
Synonyms:
CHEMBL4579711
Type:
Small organic molecule
Emp. Form.:
C24H30FN3O3S
Mol. Mass.:
459.577
SMILES:
C[C@H]1CC[C@H](c2ccccc2)S(=O)(=O)N1Cc1ccc(cc1F)N1CCN(CC1)C(C)=O
: