Target
Nuclear receptor ROR-gamma
Ligand
BDBM50536808
Substrate
Meas. Tech.
ChEMBL_1934537 (CHEMBL4480189)
EC50
31±n/a nM
Citation
 René, OFauber, BPBarnard, AChapman, KDeng, YEidenschenk, CEverett, CGobbi, AJohnson, ARLa, HNorman, MSalmon, GSummerhill, SWong, H Discovery of oxa-sultams as RORc inverse agonists showing reduced lipophilicity, improved selectivity and favorable ADME properties. Bioorg Med Chem Lett 26:4455-4461 (2016)  
Target
Name:
Nuclear receptor ROR-gamma
Synonyms:
NR1F3 Nuclear receptor ROR-gamma (RORC) RAR-related orphan receptor C (RORc) RORG RZRG Retinoid-related orphan receptor-gamma (RORc)
Type:
Enzyme Catalytic Domain
Mol. Mass.:
58218.40
Organism:
Homo sapiens (Human)
Description:
P51449
Residue:
518
  
Inhibitor
Name:
BDBM50536808
Synonyms:
CHEMBL4551326
Type:
Small organic molecule
Emp. Form.:
C23H28FN3O4S
Mol. Mass.:
461.55
SMILES:
CC(=O)N1CCN(CC1)c1ccc(CN2CCOC[C@H](c3ccccc3)S2(=O)=O)c(F)c1
: