Target
Nuclear receptor ROR-alpha
Ligand
BDBM50536796
Substrate
Meas. Tech.
ChEMBL_1934544 (CHEMBL4480196)
EC50
6800±n/a nM
Citation
 René, OFauber, BPBarnard, AChapman, KDeng, YEidenschenk, CEverett, CGobbi, AJohnson, ARLa, HNorman, MSalmon, GSummerhill, SWong, H Discovery of oxa-sultams as RORc inverse agonists showing reduced lipophilicity, improved selectivity and favorable ADME properties. Bioorg Med Chem Lett 26:4455-4461 (2016)  
Target
Name:
Nuclear receptor ROR-alpha
Synonyms:
NR1F1 Nuclear receptor subfamily 1 group F member 1 RORA RZRA | Retinoid-related orphan receptor-alpha
Type:
PROTEIN
Mol. Mass.:
58976.26
Organism:
Homo sapiens (Human)
Description:
ChEMBL_101591
Residue:
523
  
Inhibitor
Name:
BDBM50536796
Synonyms:
CHEMBL4560046
Type:
Small organic molecule
Emp. Form.:
C24H30FN3O3S
Mol. Mass.:
459.577
SMILES:
CC(=O)N1CCN(CC1)c1ccc(CN2CCCC[C@H](c3ccccc3)S2(=O)=O)c(F)c1
: