Target
Cytochrome P450 2D6
Ligand
BDBM50537147
Substrate
Meas. Tech.
ChEMBL_1935818 (CHEMBL4481577)
IC50
>50000±n/a nM
Citation
 Kotoku, MMaeba, TFujioka, SYokota, MSeki, NIto, KSuwa, YIkenogami, THirata, KHase, YKatsuda, YMiyagawa, NArita, KAsahina, KNoguchi, MNomura, ADoi, SAdachi, TCrowe, PTao, HThacher, SHashimoto, HSuzuki, TShiozaki, M Discovery of Second Generation ROR? Inhibitors Composed of an Azole Scaffold. J Med Chem 62:2837-2842 (2019)  
Target
Name:
Cytochrome P450 2D6
Synonyms:
CP2D6_HUMAN CYP2DL1 Cytochrome P450 2D6 (CYP2D6) P450-DB1
Type:
Protein
Mol. Mass.:
55774.82
Organism:
Homo sapiens (Human)
Description:
P10635
Residue:
497
  
Inhibitor
Name:
BDBM50537147
Synonyms:
CHEMBL4537625
Type:
Small organic molecule
Emp. Form.:
C26H28Cl2N3NaO5
Mol. Mass.:
556.413
SMILES:
[Na;v0+].[#6]C([#6])([#6])[#6]-c1cc(no1)-c1onc(-[#6@@H](-[#6]-[#6]-[#6](-[#8-])=O)-[#6]-[#6](=O)-[#7]-c2ccc(Cl)cc2Cl)c1-[#6]-1-[#6]-[#6]-1
: