Target
Amine oxidase [flavin-containing] B
Ligand
BDBM50172756
Substrate
Meas. Tech.
ChEMBL_1936470 (CHEMBL4482229)
IC50
220±n/a nM
Citation
 Arvizu-Espinosa, MGvon Poser, GLHenriques, ATMendoza-Ruiz, ACardador-Martínez, AGesto-Borroto, RNúñez-Aragón, PNVillarreal-Ortega, MLSharma, ACardoso-Taketa, A Bioactive Dimeric Acylphloroglucinols from the Mexican Fern Elaphoglossum paleaceum. J Nat Prod 82:785-791 (2019)  
Target
Name:
Amine oxidase [flavin-containing] B
Synonyms:
AOFB_RAT Amine oxidase [flavin-containing] B Monoamine Oxidase Type B (MAO-B) Monoamine oxidase B (MAO-B) Monoamine oxidase type B (MAOB) | Monoamine oxidase-B (MAO-B)
Type:
Enzyme
Mol. Mass.:
58469.65
Organism:
Rattus norvegicus (rat)
Description:
P19643
Residue:
520
  
Inhibitor
Name:
BDBM50172756
Synonyms:
Benzyl-methyl-prop-2-ynyl-amine Eutonyl N-benzyl-N-methylprop-2-yn-1-amine US9603833, Pargyline
Type:
Small organic molecule
Emp. Form.:
C11H13N
Mol. Mass.:
159.2276
SMILES:
CN(CC#C)Cc1ccccc1
: