Target
Muscarinic acetylcholine receptor M3
Ligand
BDBM50109647
Substrate
Meas. Tech.
ChEMBL_1972412 (CHEMBL4605230)
EC50
32±n/a nM
Citation
 Fischer, OHofmann, JRampp, HKaindl, JPratsch, GBartuschat, ATaudte, RVFromm, MFHübner, HGmeiner, PHeinrich, MR Regiospecific Introduction of Halogens on the 2-Aminobiphenyl Subunit Leading to Highly Potent and Selective M3 Muscarinic Acetylcholine Receptor Antagonists and Weak Inverse Agonists. J Med Chem 63:4349-4369 (2020)  
Target
Name:
Muscarinic acetylcholine receptor M3
Synonyms:
ACM3_HUMAN Cholinergic, muscarinic M3 Muscarinic receptor M3 | RecName: Full=Muscarinic acetylcholine receptor M3
Type:
Enzyme
Mol. Mass.:
66151.03
Organism:
Homo sapiens (Human)
Description:
P20309
Residue:
590
  
Inhibitor
Name:
BDBM50109647
Synonyms:
2-{1-[2-(2,3-Dihydro-benzofuran-5-yl)-ethyl]-pyrrolidin-3-yl}-2,2-diphenyl-acetamide (Darifenacin) DARIFENACIN Enablex
Type:
Small organic molecule
Emp. Form.:
C28H30N2O2
Mol. Mass.:
426.55
SMILES:
NC(=O)C([C@@H]1CCN(CCc2ccc3OCCc3c2)C1)(c1ccccc1)c1ccccc1
: