Target
Xanthine dehydrogenase/oxidase
Ligand
BDBM50320491
Substrate
Meas. Tech.
ChEMBL_1977029 (CHEMBL4610164)
Ki
0.600000±n/a nM
Citation
 Li, XLiu, JMa, LFu, P Pharmacological urate-lowering approaches in chronic kidney disease. Eur J Med Chem 166:186-196 (2019)  
Target
Name:
Xanthine dehydrogenase/oxidase
Synonyms:
XD XDHA XO Xanthine dehydrogenase/oxidase | Xanthine oxidase
Type:
Enzyme
Mol. Mass.:
146441.21
Organism:
Homo sapiens (Human)
Description:
P47989
Residue:
1333
  
Inhibitor
Name:
BDBM50320491
Synonyms:
2-(3-CYANO-4-ISOBUTOXY-PHENYL)-4-METHYL-5-THIAZOLE-CARBOXYLIC ACID FEBUXOSTAT | US11744839, Compound of formula 5
Type:
Small organic molecule
Emp. Form.:
C16H16N2O3S
Mol. Mass.:
316.375
SMILES:
CC(C)COc1ccc(cc1C#N)-c1nc(C)c(s1)C(O)=O
: