Target
Bromodomain-containing protein 4
Ligand
BDBM50260090
Substrate
Meas. Tech.
ChEMBL_1977638 (CHEMBL4610773)
IC50
44±n/a nM
Citation
 Zhang, FWu, ZChen, PZhang, JWang, TZhou, JZhang, H Discovery of a new class of PROTAC BRD4 degraders based on a dihydroquinazolinone derivative and lenalidomide/pomalidomide. Bioorg Med Chem 28:0 (2020)  
Target
Name:
Bromodomain-containing protein 4
Synonyms:
BRD4 Bromodomain-containing protein 4 (BRD4) Protein HUNK1
Type:
Protein
Mol. Mass.:
152264.84
Organism:
Homo sapiens (Human)
Description:
O60885
Residue:
1362
  
Inhibitor
Name:
BDBM50260090
Synonyms:
CHEMBL4076296
Type:
Small organic molecule
Emp. Form.:
C20H19N3O2
Mol. Mass.:
333.3838
SMILES:
CN1C(c2ccccc2)c2cc(ccc2NC1=O)-c1c(C)noc1C
: