Target
Cytochrome P450 2C19
Ligand
BDBM50249522
Substrate
Meas. Tech.
ChEMBL_1977766 (CHEMBL4610901)
IC50
>20000±n/a nM
Citation
 Yang, BHird, AWBodnarchuk, MSZheng, XDakin, LSu, QDaly, KGodin, RHattersley, MMBrassil, PRedmond, SJohn Russell, DJanetka, JW Heteroarylamide smoothened inhibitors: Discovery of N-[2,4-dimethyl-5-(1-methylimidazol-4-yl)phenyl]-4-(2-pyridylmethoxy)benzamide (AZD8542) and N-[5-(1H-imidazol-2-yl)-2,4-dimethyl-phenyl]-4-(2- pyridylmethoxy)benzamide (AZD7254). Bioorg Med Chem 28:0 (2020)  
Target
Name:
Cytochrome P450 2C19
Synonyms:
CP2CJ_HUMAN CYPIIC17 Cytochrome P450 2C19 (CYP2C19) Mephenytoin 4-hydroxylase P450-254C
Type:
Enzyme
Mol. Mass.:
55935.47
Organism:
Homo sapiens (Human)
Description:
P33261
Residue:
490
  
Inhibitor
Name:
BDBM50249522
Synonyms:
2-chloro-N-(4-chloro-3-(pyridin-2-yl)phenyl)-4-(methylsulfonyl)benzamide VISMODEGIB
Type:
Small organic molecule
Emp. Form.:
C19H14Cl2N2O3S
Mol. Mass.:
421.297
SMILES:
CS(=O)(=O)c1ccc(C(=O)Nc2ccc(Cl)c(c2)-c2ccccn2)c(Cl)c1
: