Target
Delta-type opioid receptor
Ligand
BDBM50023923
Substrate
Meas. Tech.
ChEMBL_146897 (CHEMBL751671)
Ki
7.8±n/a nM
Citation
 Kumar, VMurray, TFAldrich, JV Extended TIP(P) analogues as precursors for labeled delta-opioid receptor ligands. J Med Chem 43:5050-4 (2001)  
Target
Name:
Delta-type opioid receptor
Synonyms:
D-OR-1 Delta opioid receptor OPIATE Delta OPRD1 OPRK1 | opioid receptor, delta 1
Type:
G Protein-Coupled Receptor (GPCR)
Mol. Mass.:
40382.98
Organism:
Homo sapiens (Human)
Description:
Competition binding assays were carried out using membrane preparations from transfected HN9.10 cells that constitutively expressed the delta opioid receptor.
Residue:
372
  
Inhibitor
Name:
BDBM50023923
Synonyms:
CHEMBL2370989
Type:
Small organic molecule
Emp. Form.:
C42H46N6O8
Mol. Mass.:
762.85
SMILES:
N[C@@H](Cc1ccc(O)cc1)C(=O)N1Cc2ccccc2C[C@H]1C(=O)N[C@@H](Cc1ccccc1)C(=O)N[C@@H](Cc1ccccc1)C(=O)N[C@H](CCC(O)=O)C(N)=O
: