Target
Carbonic anhydrase 7
Ligand
BDBM50539860
Substrate
Meas. Tech.
ChEMBL_1979516 (CHEMBL4612651)
Ki
0.600000±n/a nM
Citation
 Berrino, EAngeli, AZhdanov, DDKiryukhina, APMilaneschi, ADe Luca, ABozdag, MCarradori, SSelleri, SBartolucci, GPeat, TSFerraroni, MSupuran, CTCarta, F Azidothymidine "Clicked" into 1,2,3-Triazoles: First Report on Carbonic Anhydrase-Telomerase Dual-Hybrid Inhibitors. J Med Chem 63:7392-7409 (2020)  
Target
Name:
Carbonic anhydrase 7
Synonyms:
CA-VII CAH7_HUMAN Carbonic anhydrase Carbonic anhydrase VII (CA VII)
Type:
Enzyme
Mol. Mass.:
29664.11
Organism:
Homo sapiens (Human)
Description:
Human cloned isozyme.
Residue:
264
  
Inhibitor
Name:
BDBM50539860
Synonyms:
CHEMBL4644555
Type:
Small organic molecule
Emp. Form.:
C24H25N5O7
Mol. Mass.:
495.4846
SMILES:
Cc1cn([C@H]2C[C@@H]([C@@H](CO)O2)n2cc(CCCOc3ccc4ccc(=O)oc4c3)nn2)c(=O)[nH]c1=O
: