Target
P2X purinoceptor 4
Ligand
BDBM50430156
Substrate
Meas. Tech.
ChEMBL_1981899 (CHEMBL4615161)
IC50
49±n/a nM
Citation
 Tian, MAbdelrahman, ABaqi, YFuentes, EAzazna, DSpanier, CDensborn, SHinz, SSchmid, RMüller, CE Discovery and Structure Relationships of Salicylanilide Derivatives as Potent, Non-acidic P2X1 Receptor Antagonists. J Med Chem 63:6164-6178 (2020)  
Target
Name:
P2X purinoceptor 4
Synonyms:
ATP receptor P2RX4_HUMAN Purinergic receptor | Purinergic, P2X4
Type:
Enzyme Catalytic Domain
Mol. Mass.:
43374.70
Organism:
Homo sapiens (Human)
Description:
Purinergic, P2X4 0 HUMAN::Q99571
Residue:
388
  
Inhibitor
Name:
BDBM50430156
Synonyms:
CHEMBL2338695
Type:
Small organic molecule
Emp. Form.:
C15H8ClF6NO2
Mol. Mass.:
383.673
SMILES:
Oc1c(Cl)cccc1C(=O)Nc1cc(cc(c1)C(F)(F)F)C(F)(F)F
: