Target
Carbonic anhydrase 6
Ligand
BDBM50540616
Substrate
Meas. Tech.
ChEMBL_1982503 (CHEMBL4615765)
Ki
69±n/a nM
Citation
 Pratesi, DMatassini, CGoti, AAngeli, ACarta, FSupuran, CTSpanevello, RCardona, F Glycomimetic Based Approach toward Selective Carbonic Anhydrase Inhibitors. ACS Med Chem Lett 11:727-731 (2020)  
Target
Name:
Carbonic anhydrase 6
Synonyms:
CA-VI CAH6_HUMAN Carbonic Anhydrase VI Carbonic anhydrase 6 Carbonic anhydrase 6 (CA-VI) Salivary carbonic anhydrase | Secreted carbonic anhydrase
Type:
Enzyme
Mol. Mass.:
35371.40
Organism:
Homo sapiens (Human)
Description:
P23280
Residue:
308
  
Inhibitor
Name:
BDBM50540616
Synonyms:
CHEMBL4643051
Type:
Small organic molecule
Emp. Form.:
C23H36N6O5S
Mol. Mass.:
508.634
SMILES:
[H][C@@]12CN(CCCCCCn3cc(CNc4ccc(cc4)S(N)(=O)=O)nn3)C[C@@H](O)[C@]1([H])OC(C)(C)O2
: