Target
Carbonic anhydrase 4
Ligand
BDBM10880
Substrate
Meas. Tech.
ChEMBL_1982501 (CHEMBL4615763)
Ki
74±n/a nM
Citation
 Pratesi, DMatassini, CGoti, AAngeli, ACarta, FSupuran, CTSpanevello, RCardona, F Glycomimetic Based Approach toward Selective Carbonic Anhydrase Inhibitors. ACS Med Chem Lett 11:727-731 (2020)  
Target
Name:
Carbonic anhydrase 4
Synonyms:
CA-IV CAH4_HUMAN Carbonic anhydrase Carbonic anhydrase IV (CA IV)
Type:
Enzyme
Mol. Mass.:
35037.98
Organism:
Homo sapiens (Human)
Description:
P22748
Residue:
312
  
Inhibitor
Name:
BDBM10880
Synonyms:
AZA AZM acetazolamide Acetazolamide Acetazolamide (AZA) Acetazolamide, 5 Acetazolamide, AZA CHEMBL20 Sulfonamide, 1 US11278534, Example acetazolamide sulfonamide 1
Type:
Small organic molecule
Emp. Form.:
C4H6N4O3S2
Mol. Mass.:
222.245
SMILES:
CC(=O)Nc1nnc(s1)S(N)(=O)=O
: