Target
Carbonic anhydrase 6
Ligand
BDBM10880
Substrate
Meas. Tech.
ChEMBL_1982503 (CHEMBL4615765)
Ki
11±n/a nM
Citation
 Pratesi, DMatassini, CGoti, AAngeli, ACarta, FSupuran, CTSpanevello, RCardona, F Glycomimetic Based Approach toward Selective Carbonic Anhydrase Inhibitors. ACS Med Chem Lett 11:727-731 (2020)  
Target
Name:
Carbonic anhydrase 6
Synonyms:
CA-VI CAH6_HUMAN Carbonic Anhydrase VI Carbonic anhydrase 6 Carbonic anhydrase 6 (CA-VI) Salivary carbonic anhydrase | Secreted carbonic anhydrase
Type:
Enzyme
Mol. Mass.:
35371.40
Organism:
Homo sapiens (Human)
Description:
P23280
Residue:
308
  
Inhibitor
Name:
BDBM10880
Synonyms:
AZA AZM acetazolamide Acetazolamide Acetazolamide (AZA) Acetazolamide, 5 Acetazolamide, AZA CHEMBL20 Sulfonamide, 1 US11278534, Example acetazolamide sulfonamide 1
Type:
Small organic molecule
Emp. Form.:
C4H6N4O3S2
Mol. Mass.:
222.245
SMILES:
CC(=O)Nc1nnc(s1)S(N)(=O)=O
: