Target
Substance-K receptor
Ligand
BDBM50096931
Substrate
Meas. Tech.
ChEBML_141789
Ki
14±n/a nM
Citation
 Ting, PCLee, JFAnthes, JCShih, NYPiwinski, JJ Synthesis of substituted 4(Z)-(methoxyimino)pentyl-1-piperidines as dual NK1/NK2 inhibitors. Bioorg Med Chem Lett 11:491-4 (2001)  
Target
Name:
Substance-K receptor
Synonyms:
NK-2 receptor NK2R NKNAR Neurokinin A receptor Neurokinin-2 (NK-2) SKR TACR2 Tachykinin receptor 2 (NK2) | hnk-3
Type:
Protein
Mol. Mass.:
44455.78
Organism:
Homo sapiens (Human)
Description:
P21452
Residue:
398
  
Inhibitor
Name:
BDBM50096931
Synonyms:
1-(3,5-Bis-trifluoromethyl-benzyloxy)-3-(3,4-dichloro-phenyl)-5-{4-[2-(2-hydroxy-ethyl)-piperidin-1-ylmethyl]-piperidin-1-yl}-pentan-2-one O-methyl-oxime | CHEMBL145302
Type:
Small organic molecule
Emp. Form.:
C34H43Cl2F6N3O3
Mol. Mass.:
726.62
SMILES:
CO\N=C(/COCc1cc(cc(c1)C(F)(F)F)C(F)(F)F)C(CCN1CCC(CN2CCCCC2CCO)CC1)c1ccc(Cl)c(Cl)c1
: