Target
Substance-K receptor
Ligand
BDBM50096951
Substrate
Meas. Tech.
ChEBML_141789
Ki
11±n/a nM
Citation
 Ting, PCLee, JFAnthes, JCShih, NYPiwinski, JJ Synthesis of substituted 4(Z)-(methoxyimino)pentyl-1-piperidines as dual NK1/NK2 inhibitors. Bioorg Med Chem Lett 11:491-4 (2001)  
Target
Name:
Substance-K receptor
Synonyms:
NK-2 receptor NK2R NKNAR Neurokinin A receptor Neurokinin-2 (NK-2) SKR TACR2 Tachykinin receptor 2 (NK2) | hnk-3
Type:
Protein
Mol. Mass.:
44455.78
Organism:
Homo sapiens (Human)
Description:
P21452
Residue:
398
  
Inhibitor
Name:
BDBM50096951
Synonyms:
1'-{5-(3,5-Bis-trifluoromethyl-benzyloxy)-3-(3,4-dichloro-phenyl)-4-[(Z)-methoxyimino]-pentyl}-[1,4']bipiperidinyl-3-carboxylic acid amide | CHEMBL342341
Type:
Small organic molecule
Emp. Form.:
C32H38Cl2F6N4O3
Mol. Mass.:
711.566
SMILES:
CO\N=C(/COCc1cc(cc(c1)C(F)(F)F)C(F)(F)F)C(CCN1CCC(CC1)N1CCCC(C1)C(N)=O)c1ccc(Cl)c(Cl)c1
: