Target
Tyrosine-protein phosphatase non-receptor type 11
Ligand
BDBM50541575
Substrate
Meas. Tech.
ChEMBL_1984808 (CHEMBL4618214)
IC50
99±n/a nM
Citation
 Wang, MLu, JWang, MYang, CYWang, S Discovery of SHP2-D26 as a First, Potent, and Effective PROTAC Degrader of SHP2 Protein. J Med Chem 63:7510-7528 (2020)  
Target
Name:
Tyrosine-protein phosphatase non-receptor type 11
Synonyms:
3.1.3.48 PTP-1D PTP2C Protein-tyrosine phosphatase 1D SH-PTP2 SHP-2 Shp2
Type:
PROTEIN
Mol. Mass.:
68018.07
Organism:
Homo sapiens
Description:
ChEMBL_11523
Residue:
593
  
Inhibitor
Name:
BDBM50541575
Synonyms:
CHEMBL4634350
Type:
Small organic molecule
Emp. Form.:
C18H23ClN6OS
Mol. Mass.:
406.933
SMILES:
CC(=O)Nc1cccc(Sc2ncc(nc2N)N2CCC(C)(N)CC2)c1Cl
: