Target
Prothrombin
Ligand
BDBM50098213
Substrate
Meas. Tech.
ChEMBL_209071 (CHEMBL809537)
IC50
13300±n/a nM
Citation
 Zhang, HCDerian, CKAndrade-Gordon, PHoekstra, WJMcComsey, DFWhite, KBPoulter, BLAddo, MFCheung, WMDamiano, BPOksenberg, DReynolds, EEPandey, AScarborough, RMMaryanoff, BE Discovery and optimization of a novel series of thrombin receptor (par-1) antagonists: potent, selective peptide mimetics based on indole and indazole templates. J Med Chem 44:1021-4 (2001)  
Target
Name:
Prothrombin
Synonyms:
Activation peptide fragment 1 Coagulation factor II Prothrombin precursor Thrombin heavy chain | Thrombin light chain
Type:
Protein
Mol. Mass.:
70029.57
Organism:
Homo sapiens (Human)
Description:
P00734
Residue:
622
  
Inhibitor
Name:
BDBM50098213
Synonyms:
2-(2-{3-[1-(4-Fluoro-benzyl)-3-pyrrolidin-1-ylmethyl-1H-indol-6-yl]-ureido}-3-phenyl-propionylamino)-5-guanidino-pentanoic acid benzylamide | CHEMBL275946
Type:
Small organic molecule
Emp. Form.:
C43H50FN9O3
Mol. Mass.:
759.914
SMILES:
NC(=N)NCCC[C@H](NC(=O)[C@H](Cc1ccccc1)NC(=O)Nc1ccc2c(CN3CCCC3)cn(Cc3ccc(F)cc3)c2c1)C(=O)NCc1ccccc1
: