Target
Cytochrome P450 3A4
Ligand
BDBM50541823
Substrate
Meas. Tech.
ChEMBL_1985395 (CHEMBL4618801)
IC50
2600±n/a nM
Citation
 Li, YPasunooti, KKPeng, HLi, RJShi, WQLiu, WCheng, ZHead, SALiu, JO Design and Synthesis of Tetrazole- and Pyridine-Containing Itraconazole Analogs as Potent Angiogenesis Inhibitors. ACS Med Chem Lett 11:1111-1117 (2020)  
Target
Name:
Cytochrome P450 3A4
Synonyms:
Albendazole monooxygenase CP3A4_HUMAN CYP3A4 CYPIIIA4 Cytochrome P450 3A4 (CYP3A4) Nifedipine oxidase Taurochenodeoxycholate 6-alpha-hydroxylase
Type:
Enzyme
Mol. Mass.:
57349.57
Organism:
Homo sapiens (Human)
Description:
Residue:
503
  
Inhibitor
Name:
BDBM50541823
Synonyms:
CHEMBL4644787
Type:
Small organic molecule
Emp. Form.:
C35H38Cl2N8O4
Mol. Mass.:
705.633
SMILES:
CCC(C)n1ncn(-c2ccc(cc2)N2CCN(CC2)c2ccc(OC[C@@H]3CO[C@](Cn4ccnc4)(O3)c3ccc(Cl)cc3Cl)cn2)c1=O
: