Target
Growth factor receptor-bound protein 2
Ligand
BDBM50099450
Substrate
Meas. Tech.
ChEBML_72366
IC50
11±n/a nM
Citation
 Schoepfer, JGay, BEnd, NMuller, EScheffel, GCaravatti, GFuret, P Convergent synthesis of potent peptide inhibitors of the Grb2-SH2 domain by palladium catalyzed coupling of a terminal alkyne. Bioorg Med Chem Lett 11:1201-3 (2001)  
Target
Name:
Growth factor receptor-bound protein 2
Synonyms:
ASH GRB2 adapter protein Grb2-SH2 | Growth factor receptor-bound protein 2
Type:
Protein
Mol. Mass.:
25205.04
Organism:
Homo sapiens (Human)
Description:
P62993
Residue:
217
  
Inhibitor
Name:
BDBM50099450
Synonyms:
CHEMBL19378 | {4-[(S)-2-Acetylamino-2-(1-{(S)-2-carbamoyl-1-[3-(8-hydroxy-naphthalen-2-yl)-propylcarbamoyl]-ethylcarbamoyl}-cyclohexylcarbamoyl)-ethyl]-benzyl}-phosphonic acid
Type:
Small organic molecule
Emp. Form.:
C36H46N5O9P
Mol. Mass.:
723.7523
SMILES:
CC(=O)N[C@@H](Cc1ccc(CP(O)(O)=O)cc1)C(=O)NC1(CCCCC1)C(=O)N[C@@H](CC(N)=O)C(=O)NCCCc1ccc2cccc(O)c2c1
: