Target
Egl nine homolog 1
Ligand
BDBM50543054
Substrate
Meas. Tech.
ChEMBL_1988321 (CHEMBL4621868)
IC50
23±n/a nM
Citation
 Goi, TNakajima, TKomatsu, YKawata, AYamakoshi, SOkada, OSugahara, MUmeda, ATakada, YMurakami, JOhashi, RWatanabe, TFukase, K Pyrazolo[4,3- ACS Med Chem Lett 11:1416-1420 (2020)  
Target
Name:
Egl nine homolog 1
Synonyms:
C1orf12 EGLN1_HUMAN Hypoxia-inducible factor prolyl hydroxylase 2 (HIF-PH2) Prolyl hydroxylase domain-containing protein 2 (PHD2)
Type:
Protein
Mol. Mass.:
46035.59
Organism:
Homo sapiens (Human)
Description:
Q9GZT9
Residue:
426
  
Inhibitor
Name:
BDBM50543054
Synonyms:
CHEMBL4648388
Type:
Small organic molecule
Emp. Form.:
C23H16N4O3S
Mol. Mass.:
428.463
SMILES:
OC(=O)c1cnn(c1)-c1nc2scc(Cc3ccc(cc3)-c3ccccc3)c2c(=O)[nH]1
: