Target
Nitric oxide synthase, inducible
Ligand
BDBM50095298
Substrate
Meas. Tech.
ChEMBL_1988427 (CHEMBL4621974)
IC50
428±n/a nM
Citation
 Maccallini, CArias, FGallorini, MAmoia, PAmmazzalorso, ADe Filippis, BFantacuzzi, MGiampietro, LCataldi, ACamacho, MEAmoroso, R Antiglioma Activity of Aryl and Amido-Aryl Acetamidine Derivatives Targeting iNOS: Synthesis and Biological Evaluation. ACS Med Chem Lett 11:1470-1475 (2020)  
Target
Name:
Nitric oxide synthase, inducible
Synonyms:
HEP-NOS Inducible NO synthase NOS type II NOS2A Nitric oxide synthase, inducible (iNOS) | iNOS
Type:
Homodimer
Mol. Mass.:
131141.95
Organism:
Homo sapiens (Human)
Description:
P35228
Residue:
1153
  
Inhibitor
Name:
BDBM50095298
Synonyms:
CHEMBL3589087
Type:
Small organic molecule
Emp. Form.:
C14H19N3O3
Mol. Mass.:
277.319
SMILES:
CC(=N)NCc1cccc(CNC(=O)CCC(O)=O)c1
: