Target
Alpha-enolase
Ligand
BDBM50543112
Substrate
Meas. Tech.
ChEMBL_1988448 (CHEMBL4621995)
IC50
2554±n/a nM
Citation
 Yan, VCYang, KLBallato, ESKhadka, SShrestha, PArthur, KGeorgiou, DKWashington, MTran, TPoral, AHPham, CDYan, MJMuller, FL Bioreducible Phosphonoamidate Pro-drug Inhibitor of Enolase: Proof of Concept Study. ACS Med Chem Lett 11:1484-1489 (2020)  
Target
Name:
Alpha-enolase
Synonyms:
2-phospho-D-glycerate hydro-lyase C-myc promoter-binding protein ENO1L1 Enolase 1 MBP-1 MPB-1 NNE Phosphopyruvate hydratase | Plasminogen-binding protein
Type:
Mol. Mass.:
47171.43
Organism:
Homo sapiens (Human)
Description:
P06733
Residue:
434
  
Inhibitor
Name:
BDBM50543112
Synonyms:
Evofosfamide TH-302
Type:
Small organic molecule
Emp. Form.:
C9H16Br2N5O4P
Mol. Mass.:
449.036
SMILES:
Cn1c(COP(=O)(NCCBr)NCCBr)cnc1[N+]([O-])=O
: