Target
Alpha-enolase
Ligand
BDBM50543113
Substrate
Meas. Tech.
ChEMBL_1988451 (CHEMBL4621998)
IC50
5764±n/a nM
Citation
 Yan, VCYang, KLBallato, ESKhadka, SShrestha, PArthur, KGeorgiou, DKWashington, MTran, TPoral, AHPham, CDYan, MJMuller, FL Bioreducible Phosphonoamidate Pro-drug Inhibitor of Enolase: Proof of Concept Study. ACS Med Chem Lett 11:1484-1489 (2020)  
Target
Name:
Alpha-enolase
Synonyms:
2-phospho-D-glycerate hydro-lyase C-myc promoter-binding protein ENO1L1 Enolase 1 MBP-1 MPB-1 NNE Phosphopyruvate hydratase | Plasminogen-binding protein
Type:
Mol. Mass.:
47171.43
Organism:
Homo sapiens (Human)
Description:
P06733
Residue:
434
  
Inhibitor
Name:
BDBM50543113
Synonyms:
CHEMBL4643988
Type:
Small organic molecule
Emp. Form.:
C19H22N3O8P
Mol. Mass.:
451.367
SMILES:
CC(=O)ON1CCCC(C1=O)P(=O)(NCc1ccccc1)OCc1ccc(o1)[N+]([O-])=O
: