Target
Toll-like receptor 9
Ligand
BDBM50543143
Substrate
Meas. Tech.
ChEMBL_1988679 (CHEMBL4622226)
IC50
200±n/a nM
Citation
 Knoepfel, TNimsgern, PJacquier, SBourrel, MVangrevelinghe, EGlatthar, RBehnke, DAlper, PBMichellys, PYDeane, JJunt, TZipfel, GLimonta, SHawtin, SAndre, CBoulay, TLoetscher, PFaller, MBlank, JFeifel, RBetschart, C Target-Based Identification and Optimization of 5-Indazol-5-yl Pyridones as Toll-like Receptor 7 and 8 Antagonists Using a Biochemical TLR8 Antagonist Competition Assay. J Med Chem 63:8276-8295 (2020)  
Target
Name:
Toll-like receptor 9
Synonyms:
CD_antigen: CD289 TLR9_HUMAN
Type:
Enzyme
Mol. Mass.:
115889.91
Organism:
Homo sapiens (Human)
Description:
Q9NR96
Residue:
1032
  
Inhibitor
Name:
BDBM50543143
Synonyms:
CHEMBL4643502
Type:
Small organic molecule
Emp. Form.:
C20H24N4O
Mol. Mass.:
336.4308
SMILES:
Cc1cc(cc2cn(nc12)C1CCNCC1)-c1cc(C)c(=O)n(C)c1
: