Target
Toll-like receptor 8
Ligand
BDBM50543154
Substrate
Meas. Tech.
ChEMBL_1988678 (CHEMBL4622225)
IC50
47±n/a nM
Citation
 Knoepfel, TNimsgern, PJacquier, SBourrel, MVangrevelinghe, EGlatthar, RBehnke, DAlper, PBMichellys, PYDeane, JJunt, TZipfel, GLimonta, SHawtin, SAndre, CBoulay, TLoetscher, PFaller, MBlank, JFeifel, RBetschart, C Target-Based Identification and Optimization of 5-Indazol-5-yl Pyridones as Toll-like Receptor 7 and 8 Antagonists Using a Biochemical TLR8 Antagonist Competition Assay. J Med Chem 63:8276-8295 (2020)  
Target
Name:
Toll-like receptor 8
Synonyms:
CD_antigen: CD288 TLR8_HUMAN | TRL8
Type:
Enzyme
Mol. Mass.:
119828.77
Organism:
Homo sapiens (Human)
Description:
Q9NR97
Residue:
1041
  
Inhibitor
Name:
BDBM50543154
Synonyms:
CHEMBL4633423
Type:
Small organic molecule
Emp. Form.:
C21H26N4O
Mol. Mass.:
350.4573
SMILES:
CN1CCC(CC1)n1cc2cc(cc(C)c2n1)-c1ccc(=O)n(C)c1C
: