Target
5-hydroxytryptamine receptor 7
Ligand
BDBM50075360
Substrate
Meas. Tech.
ChEBML_3699
Ki
>10000±n/a nM
Citation
 Huang, YKegeles, LSBae, SHwang, DRoth, BLSavage, JELaruelle, M Synthesis of potent and selective dopamine D(4) antagonists as candidate radioligands. Bioorg Med Chem Lett 11:1375-7 (2001)  
Target
Name:
5-hydroxytryptamine receptor 7
Synonyms:
5-HT-7 5-HT7 5-HT7S 5HT7 HTR7 | Serotonin receptor 7
Type:
G Protein-Coupled Receptor (GPCR)
Mol. Mass.:
53573.08
Organism:
Homo sapiens (Human)
Description:
P34969
Residue:
479
  
Inhibitor
Name:
BDBM50075360
Synonyms:
3-[4-(4-Methoxy-phenyl)-piperazin-1-ylmethyl]-1H-pyrrolo[2,3-b]pyridine | CHEMBL28607
Type:
Small organic molecule
Emp. Form.:
C19H22N4O
Mol. Mass.:
322.4042
SMILES:
COc1ccc(cc1)N1CCN(Cc2c[nH]c3ncccc23)CC1
: