Target
5-hydroxytryptamine receptor 1D
Ligand
BDBM50099893
Substrate
Meas. Tech.
ChEBML_1725
Ki
>10000±n/a nM
Citation
 Huang, YKegeles, LSBae, SHwang, DRoth, BLSavage, JELaruelle, M Synthesis of potent and selective dopamine D(4) antagonists as candidate radioligands. Bioorg Med Chem Lett 11:1375-7 (2001)  
Target
Name:
5-hydroxytryptamine receptor 1D
Synonyms:
5-HT-1D 5-HT1D 5HT1D_HUMAN HTR1DA Serotonin (5-HT) receptor | Serotonin Receptor 1D
Type:
G Protein-Coupled Receptor (GPCR)
Mol. Mass.:
41920.63
Organism:
Homo sapiens (Human)
Description:
Receptor binding assays were performed using human clone stably expressed in CHO cells.
Residue:
377
  
Inhibitor
Name:
BDBM50099893
Synonyms:
3-[4-(4-Fluoro-phenyl)-piperazin-1-ylmethyl]-1H-pyrrolo[2,3-b]pyridine | CHEMBL28997
Type:
Small organic molecule
Emp. Form.:
C18H19FN4
Mol. Mass.:
310.3687
SMILES:
Fc1ccc(cc1)N1CCN(Cc2c[nH]c3ncccc23)CC1
: