Target
Alpha-1A adrenergic receptor
Ligand
BDBM50100210
Substrate
Meas. Tech.
ChEMBL_34023 (CHEMBL646012)
Ki
0.04±n/a nM
Citation
 Meyer, MDAltenbach, RJBai, HBasha, FZCarroll, WAKerwin, JFLebold, SALee, EPratt, JKSippy, KBTietje, KWendt, MDBrune, MEBuckner, SAHancock, AADrizin, I Structure-activity studies for a novel series of bicyclic substituted hexahydrobenz[e]isoindole alpha1A adrenoceptor antagonists as potential agents for the symptomatic treatment of benign prostatic hyperplasia. J Med Chem 44:1971-85 (2001)  
Target
Name:
Alpha-1A adrenergic receptor
Synonyms:
ADA1A_RAT Adra1c Alpha-1A adrenoceptor Alpha-1C adrenergic receptor | adrenergic Alpha1A
Type:
Protein
Mol. Mass.:
51620.15
Organism:
Rattus norvegicus (Rat)
Description:
P43140
Residue:
466
  
Inhibitor
Name:
BDBM50100210
Synonyms:
6-Methoxy-3-[2-(6-methoxy-1,3,3a,4,5,9b-hexahydro-benzo[e]isoindol-2-yl)-ethyl]-1H-thieno[3,2-d]pyrimidine-2,4-dione | CHEMBL62028
Type:
Small organic molecule
Emp. Form.:
C22H25N3O4S
Mol. Mass.:
427.517
SMILES:
COc1cc2[nH]c(=O)n(CCN3C[C@@H]4CCc5c(OC)cccc5[C@@H]4C3)c(=O)c2s1
: