Target
Tryptase beta-2/delta/gamma
Ligand
BDBM50101016
Substrate
Meas. Tech.
ChEMBL_210696 (CHEMBL817294)
Ki
1.1±n/a nM
Citation
 Dener, JMRice, KDNewcomb, WSWang, VRYoung, WBGangloff, ARKuo, EYCregar, LPutnam, DWong, M Dibasic inhibitors of human mast cell tryptase. Part 3: identification of a series of potent and selective inhibitors containing the benzamidine functionality. Bioorg Med Chem Lett 11:1629-33 (2001)  
Target
Name:
Tryptase beta-2/delta/gamma
Synonyms:
Tryptase
Type:
Mol. Mass.:
Description:
ASSAY_ID of ChEMBL is 1510505
Components:
This complex has 3 components.
Component 1
Name:
Tryptase gamma
Synonyms:
PRSS31 TMT TRYG1_HUMAN Tryptase Tryptase gamma heavy chain | Tryptase gamma light chain
Type:
PROTEIN
Mol. Mass.:
33817.52
Organism:
Homo sapiens (Human)
Description:
ChEMBL_210833
Residue:
321
  
Component 2
Name:
Tryptase beta-2
Synonyms:
TPS2 TRYB2_HUMAN Tryptase II Tryptase-2
Type:
PROTEIN
Mol. Mass.:
30518.79
Organism:
Homo sapiens (Human)
Description:
ChEMBL_210702
Residue:
275
  
Component 3
Name:
Tryptase delta
Synonyms:
Delta-tryptase Mast cell mMCP-7-like TRYD_HUMAN Tryptase-3
Type:
PROTEIN
Mol. Mass.:
26578.73
Organism:
Homo sapiens (Human)
Description:
ChEMBL_104777
Residue:
242
  
Inhibitor
Name:
BDBM50101016
Synonyms:
1-{4-[4-amino(imino)methylbenzylcarbamoyl]hexahydro-1-pyrazinylcarbonyloxy}-5-[4-(4-hexahydro-4-pyridinylbutanoyl)hexahydro-1-pyrazinylcarbonyloxy]cyclooctane | CHEMBL42898
Type:
Small organic molecule
Emp. Form.:
C36H56N8O6
Mol. Mass.:
696.8798
SMILES:
NC(=N)c1ccc(CNC(=O)N2CCN(CC2)C(=O)O[C@@H]2CCC[C@@H](CCC2)OC(=O)N2CCN(CC2)C(=O)CCCC2CCNCC2)cc1
: