Target
Chymase
Ligand
BDBM50101131
Substrate
Meas. Tech.
ChEBML_197650
IC50
140±n/a nM
Citation
 Aoyama, YUenaka, MKonoike, THayasaki-Kajiwara, YNaya, NNakajima, M Inhibition of serine proteases: activity of 1,3-diazetidine-2,4-diones. Bioorg Med Chem Lett 11:1691-4 (2001)  
Target
Name:
Chymase
Synonyms:
Alpha-chymase CMA1_HUMAN CYM Mast cell protease I
Type:
Enzyme
Mol. Mass.:
27340.12
Organism:
Homo sapiens (Human)
Description:
Residue:
247
  
Inhibitor
Name:
BDBM50101131
Synonyms:
1,3-Di-p-tolyl-[1,3]diazetidine-2,4-dione | CHEMBL296771
Type:
Small organic molecule
Emp. Form.:
C16H14N2O2
Mol. Mass.:
266.2946
SMILES:
Cc1ccc(cc1)N1C(=O)N(C1=O)c1ccc(C)cc1
: